{"text_format":"1","workbook":"xlsx","n_sheets":15,"sheets":["Cover","Expenditures","Revenues","Signature Page","Current Year Report-Expenses","Current Year Report - Revenues","Comparison Report","NEW CODES","PreDATAFY24","BUDDATAFY24","LISTvoc","FY23Exp","FY23Rev","FY23BUD","FY23prefillData"],"not_rendered":{"charts":0,"images":2,"macros":1,"external_links":0,"defined_names":12,"comments":2,"pivot_tables":0},"unopened":[],"bounds":{"document_bytes":16777216,"sheet_cells":100000,"rows_first":2000,"rows_last":500,"rows_between":2000,"halvings":0,"cell_chars":16384,"cell_head_chars":4096},"cells_cut":0,"cells_raw":0,"read":"whole","date_system":"1900"}

{"sheet":"Cover","index":0,"n_rows":24,"n_cols":22,"rows_kept":24,"cut":false,"hidden":false,"merged":[]}
[null,null,null,"FY2024 Budget Data Entry Template"]
[null,null,null,"Due Date: June 1st, 2023",null,null,null,null,null,null,null,null,null,null,null,null,null,null,null,null,{"$f":"VLOOKUP($F$6,'NEW CODES'!$C$2:$D$130,2,FALSE)","v":{"$error":"#N/A"}}]
[null,null,null,"Vermont Agency of Education Help Desk (802) 828-1017"]
[null,null,"Please create a folder on your \"Local Disk\" C drive called \"BUDGET\" before using this template",null,null,null,null,null,null,"The following applies to SUs with multiple districts (an oxymoron . . .):",null,null,null,null,null,null,null,null,null,null,{"$f":"IF(SUM(Expenditures!$G$2:$G$11,Expenditures!$G$13,Expenditures!$G$15:$G$21)<>SUM(Revenues!$G$2:$G$8,Revenues!$G$10:$G$19,Revenues!$G$21:$G$27,Revenues!$G$29:$G$32,Revenues!$G$34:$G$37,Revenues!$G$39,Revenues!$G$41:$G$42,Revenues!$G$44:$G$51),1,0)","v":0},{"$f":"IF(U4=1,\"Revenues do not equal expenditures!\",\"\")","v":""}]
[]
[null,"Please Select Your Organization:",null,"** SELECT DISTRICT **",null,{"$f":"IFERROR(VLOOKUP(D6,'NEW CODES'!B2:C130,2,FALSE),\"X\")","v":"X"},null,null,null,"The 5% local share of SpEd extraordinary costs are at the SU level."]
[null,null,null,null,null,null,null,null,null,"I need them at the district level in order to use them as exclusions for excess spending."]
[null,null,null,null,null,null,null,null,null,"You will have to break them out and send them back to me in this file."]
[null,null,null,null,null,null,null,null,null,"I will send you the data at the SU level so you can do that.  You're welcome."]
[null,null,null,null,null,null,null,null,null,"I will take your data and use it when I look at the excess spending."]
{"$rows_left_out":15}
{"sheet":"Expenditures","index":1,"n_rows":31,"n_cols":12,"rows_kept":31,"cut":false,"hidden":false,"merged":[]}
["DSTID","TYP","FUND","FUND DESCRIPTION","FUNC","FUNCTION DESCRIPTION","AMOUNT","FY",null,"FY23 Exp"]
[{"$f":"Cover!F$6","v":"X"},"E","1",{"$f":"IF(C2=\"1\",\"LOCAL EDUCATION\",\"CAPITAL PROJECT FUNDS\")","v":"LOCAL EDUCATION"},"1000","DIRECT INSTR-EXCEPT TECH CTR TUITION",null,"FY24",null,{"$f":"IF(OR($C2=\"1\",$C2=\"7\"),SUMIFS(FY23Exp!$I$2:$I$1922,FY23Exp!$C$2:$C$1922,$A2,FY23Exp!$G$2:$G$1922,$E2),\"??\")","v":0}]
[{"$f":"Cover!F$6","v":"X"},"E","1",{"$f":"IF(C3=\"1\",\"LOCAL EDUCATION\",\"CAPITAL PROJECT FUNDS\")","v":"LOCAL EDUCATION"},"1568","OBJ 568-TCH CTR TUIT/AMT STATE PAYS FOR DST",{"$f":"SUMIF(FY23prefillData!$A$3:$A$329,$A3,FY23prefillData!$D$3:$D$329)","v":0},"FY24",null,{"$f":"IF(OR($C3=\"1\",$C3=\"7\"),SUMIFS(FY23Exp!$I$2:$I$1922,FY23Exp!$C$2:$C$1922,$A3,FY23Exp!$G$2:$G$1922,$E3),\"??\")","v":0},null,"Formula in cell - do not delete"]
[{"$f":"Cover!F$6","v":"X"},"E","1","LOCAL EDUCATION","1569","OBJ 569-DISTRICT TUITION TO TECH CNTRS",null,"FY24",null,{"$f":"IF(OR($C4=\"1\",$C4=\"7\"),SUMIFS(FY23Exp!$I$2:$I$1922,FY23Exp!$C$2:$C$1922,$A4,FY23Exp!$G$2:$G$1922,$E4),\"??\")","v":0}]
[{"$f":"Cover!F$6","v":"X"},"E","1","LOCAL EDUCATION","2396","ADMINISTRATIVE SUPPORT SERVICES - LEA",null,"FY24",null,{"$f":"IF(OR($C5=\"1\",$C5=\"7\"),SUMIFS(FY23Exp!$I$2:$I$1922,FY23Exp!$C$2:$C$1922,$A5,FY23Exp!$G$2:$G$1922,$E5),\"??\")","v":0}]
[{"$f":"Cover!F$6","v":"X"},"E","1","LOCAL EDUCATION","2397","ADMINISTRATIVE SUPPORT SERV. - ASSESS TO SU",null,"FY24",null,{"$f":"IF(OR($C6=\"1\",$C6=\"7\"),SUMIFS(FY23Exp!$I$2:$I$1922,FY23Exp!$C$2:$C$1922,$A6,FY23Exp!$G$2:$G$1922,$E6),\"??\")","v":0}]
[{"$f":"Cover!F$6","v":"X"},"E","1","LOCAL EDUCATION","2999","ALL FUNC 2000 SUPPORT SERV. NOT INCL. ABOVE",null,"FY24",null,{"$f":"IF(OR($C7=\"1\",$C7=\"7\"),SUMIFS(FY23Exp!$I$2:$I$1922,FY23Exp!$C$2:$C$1922,$A7,FY23Exp!$G$2:$G$1922,$E7),\"??\")","v":0}]
[{"$f":"Cover!F$6","v":"X"},"E","1","LOCAL EDUCATION","3100","FOOD SERVICES",null,"FY24",null,{"$f":"IF(OR($C8=\"1\",$C8=\"7\"),SUMIFS(FY23Exp!$I$2:$I$1922,FY23Exp!$C$2:$C$1922,$A8,FY23Exp!$G$2:$G$1922,$E8),\"??\")","v":0}]
[{"$f":"Cover!F$6","v":"X"},"E","1","LOCAL EDUCATION","3200","ENTERPRISE OPERATIONS",null,"FY24",null,{"$f":"IF(OR($C9=\"1\",$C9=\"7\"),SUMIFS(FY23Exp!$I$2:$I$1922,FY23Exp!$C$2:$C$1922,$A9,FY23Exp!$G$2:$G$1922,$E9),\"??\")","v":0}]
[{"$f":"Cover!F$6","v":"X"},"E","1","LOCAL EDUCATION","3300","COMMUNITY SERVICES",null,"FY24",null,{"$f":"IF(OR($C10=\"1\",$C10=\"7\"),SUMIFS(FY23Exp!$I$2:$I$1922,FY23Exp!$C$2:$C$1922,$A10,FY23Exp!$G$2:$G$1922,$E10),\"??\")","v":0}]
{"$rows_left_out":22}
{"sheet":"Revenues","index":2,"n_rows":55,"n_cols":12,"rows_kept":55,"cut":false,"hidden":false,"merged":[]}
["DISTID","TYP","FUND","Fund Description","FUNC","FUNCTION DESCRIPTION","AMOUNT","FY",null,"FY23 Rev"]
[{"$f":"Cover!F6","v":"X"},"R","5",{"$f":"IF(C2=\"5\",\"GENERAL FUND\",\"CAPITAL PROJECT FUNDS\")","v":"GENERAL FUND"},"1110","SPECIAL PROPERTY TAX ASSMT(FOR SOME INCORP. DISTS)",null,"FY24",null,{"$f":"IF(OR($C2=\"5\",$C2=\"7\"),SUMIFS(FY23Rev!$I$2:$I$1996,FY23Rev!$B$2:$B$1996,$A2,FY23Rev!$G$2:$G$1996,$E2),\"??\")","v":0}]
[{"$f":"Cover!F6","v":"X"},"R","5",{"$f":"IF(C3=\"5\",\"GENERAL FUND\",\"CAPITAL PROJECT FUNDS\")","v":"GENERAL FUND"},"1170","NON-PROPERTY TAXES/IMPACT FEES",null,"FY24",null,{"$f":"IF(OR($C3=\"5\",$C3=\"7\"),SUMIFS(FY23Rev!$I$2:$I$1996,FY23Rev!$B$2:$B$1996,$A3,FY23Rev!$G$2:$G$1996,$E3),\"??\")","v":0}]
[{"$f":"Cover!F6","v":"X"},"R","5","GENERAL FUND","1180","DELINQ TAXES/RELATED PENALTIES/INT (INCORP DIST)",null,"FY24",null,{"$f":"IF(OR($C4=\"5\",$C4=\"7\"),SUMIFS(FY23Rev!$I$2:$I$1996,FY23Rev!$B$2:$B$1996,$A4,FY23Rev!$G$2:$G$1996,$E4),\"??\")","v":0}]
[{"$f":"Cover!F6","v":"X"},"R","5","GENERAL FUND","1200","REVENUES FROM LOCAL GOVERNMENT - NOT LEAS",null,"FY24",null,{"$f":"IF(OR($C5=\"5\",$C5=\"7\"),SUMIFS(FY23Rev!$I$2:$I$1996,FY23Rev!$B$2:$B$1996,$A5,FY23Rev!$G$2:$G$1996,$E5),\"??\")","v":0}]
[{"$f":"Cover!F6","v":"X"},"R","5","GENERAL FUND","1300","TUITION RECEIVED",null,"FY24",null,{"$f":"IF(OR($C6=\"5\",$C6=\"7\"),SUMIFS(FY23Rev!$I$2:$I$1996,FY23Rev!$B$2:$B$1996,$A6,FY23Rev!$G$2:$G$1996,$E6),\"??\")","v":0}]
[{"$f":"Cover!F6","v":"X"},"R","5","GENERAL FUND","1400","TRANSPORTATION FEES RECEIVED",null,"FY24",null,{"$f":"IF(OR($C7=\"5\",$C7=\"7\"),SUMIFS(FY23Rev!$I$2:$I$1996,FY23Rev!$B$2:$B$1996,$A7,FY23Rev!$G$2:$G$1996,$E7),\"??\")","v":0}]
[{"$f":"Cover!F6","v":"X"},"R","5","GENERAL FUND","1500","EARNINGS ON INVESTMENTS",null,"FY24",null,{"$f":"IF(OR($C8=\"5\",$C8=\"7\"),SUMIFS(FY23Rev!$I$2:$I$1996,FY23Rev!$B$2:$B$1996,$A8,FY23Rev!$G$2:$G$1996,$E8),\"??\")","v":0}]
[{"$f":"Cover!F6","v":"X"},"R","6","CAPITAL PROJECT FUNDS","1500","EARNINGS ON INVESTMENTS",null,"FY24",null,{"$f":"IF(OR($C9=\"5\",$C9=\"7\"),SUMIFS(FY23Rev!$I$2:$I$1996,FY23Rev!$B$2:$B$1996,$A9,FY23Rev!$G$2:$G$1996,$E9),\"??\")","v":"??"}]
[{"$f":"Cover!F6","v":"X"},"R","5","GENERAL FUND","1600","FOOD SERVICE (IF EXPENDITURES INCLUDED IN BUDGET)",null,"FY24",null,{"$f":"IF(OR($C10=\"5\",$C10=\"7\"),SUMIFS(FY23Rev!$I$2:$I$1996,FY23Rev!$B$2:$B$1996,$A10,FY23Rev!$G$2:$G$1996,$E10),\"??\")","v":0}]
{"$rows_left_out":46}
{"sheet":"Signature Page","index":3,"n_rows":39,"n_cols":12,"rows_kept":39,"cut":false,"hidden":false,"merged":[[30,1,31,1],[33,1,33,11],[36,8,36,11],[38,2,38,6],[38,8,38,11],[36,1,36,7]]}
[null,null,null,null,null,"2024 Budget Collection"]
[]
["LEAID:",{"$f":"Cover!F6","v":"X"}]
["LEANAME:",{"$f":"Cover!$U$2","v":{"$error":"#N/A"}},null,null,null,null,null,null,null,null,null,"Amount"]
[]
["a1.  Amount to be voted on plus tuition to self-governing technical centers",null,null,null,null,null,null,null,null,null,null,{"$f":"SUM('Current Year Report-Expenses'!F50)-'Current Year Report-Expenses'!F37","v":0}]
[]
["a2. Deficit payment (Function 6999)",null,null,null,null,null,null,null,null,null,null,{"$f":"SUM('Current Year Report-Expenses'!F37)","v":0}]
[]
["A. Anticipated budgeted expenditures"]
{"$rows_left_out":30}
{"sheet":"Current Year Report-Expenses","index":4,"n_rows":50,"n_cols":7,"rows_kept":50,"cut":false,"hidden":false,"merged":[[5,0,5,4],[6,0,6,4],[8,0,8,4],[12,0,12,4],[14,0,14,4],[10,2,10,4],[43,0,43,3],[36,0,36,4],[35,0,35,4],[13,0,13,4],[49,0,49,4],[25,0,25,4],[33,0,33,4],[29,0,29,4],[30,0,30,4],[31,0,31,4],[32,0,32,4],[27,0,27,4],[28,0,28,4],[26,0,26,4],[40,0,40,3],[0,0,2,6],[4,0,4,6],[34,0,34,6],[15,2,15,6],[9,2,9,6],[7,0,7,6],[22,0,22,4],[24,0,24,4],[17,0,17,4],[18,0,18,4],[19,0,19,4],[20,2,20,4],[11,0,11,4],[15,0,16,1],[16,2,16,4],[9,0,10,1]]}
["Current Year Report, FY2024 - Expenses"]
[]
[]
["LEAID",{"$f":"Cover!F$6","v":"X"},"LEANAME",{"$f":"Cover!$U$2","v":{"$error":"#N/A"}},null,"FUND 1","FUND 6"]
["1000 DIRECT INSTRUCTION"]
["1000 DIRECT INSTR-EXCEPT TECH CTR TUITION",null,null,null,null,{"$f":"Expenditures!G$2","v":0},0]
["1568 OBJ 568-TCH CTR TUIT/AMT STATE PAYS FOR DST",null,null,null,null,{"$f":"Expenditures!G$3","v":0},0]
["(87% of the base amount for each FTE)"]
["1569 OBJ 569-DISTRICT TUITION TO TECH CNTRS ",null,null,null,null,{"$f":"Expenditures!G$4","v":0},0]
[]
{"$rows_left_out":41}
{"sheet":"Current Year Report - Revenues","index":5,"n_rows":112,"n_cols":6,"rows_kept":112,"cut":false,"hidden":false,"merged":[[18,1,18,3],[56,1,56,3],[58,1,58,3],[50,1,50,3],[43,1,43,3],[47,1,47,3],[32,1,32,3],[23,1,23,3],[26,1,26,3],[21,1,21,3],[0,0,2,5],[15,1,15,3],[12,1,12,3],[9,1,9,3],[8,1,8,3],[6,1,6,3],[59,1,59,3],[29,1,29,3],[33,1,33,3],[36,1,36,3],[38,1,38,3],[41,1,41,3],[44,1,44,3],[45,1,45,3],[46,1,46,3],[48,1,48,3],[49,1,49,3],[53,1,53,3]]}
["Current Year Report, FY2024 - Revenues"]
[]
[]
["LEAID",{"$f":"Cover!F$6","v":"X"},"LEANAME",{"$f":"Cover!$U$2","v":{"$error":"#N/A"}},"Fund 5","Fund 6"]
[]
["1100 STATUTORY TAXES"]
[null,"1110   SPECIAL PROPERTY TAX ASSMT(FOR SOME INCORP. DISTS) ",null,null,{"$f":"Revenues!G2","v":0},0]
[null,"1115    PROPERTY TAX - ACT 144",null,null,0,0]
[null,"1170   NON-PROPERTY TAXES/IMPACT FEES ",null,null,{"$f":"Revenues!G3","v":0},0]
[null,"1180   DELINQ TAXES/RELATED PENALTIES/INT (INCORP DIST) ",null,null,{"$f":"Revenues!G4","v":0},0]
{"$rows_left_out":103}
{"sheet":"Comparison Report","index":6,"n_rows":28,"n_cols":19,"rows_kept":28,"cut":false,"hidden":false,"merged":[[0,1,0,13],[1,1,1,13],[3,2,3,4],[3,6,3,8],[3,10,3,12]]}
[null,null,null,null,null,null,null,null,null,null,null,null,null,null,null,null,null,null,{"$f":"IF($B$6=\"U061\",\"Lincoln included in prior year data.\",\"\")&IF($B$6=\"T112\",\"No prior year data for Lincoln.\",\"\")&IF($B$6=\"U090\",\"Stowe included in prior year data.\",\"\")&IF($B$6=\"T198\",\"No prior year data for Stowe.\",\"\")","v":""}]
[null,"Comparison of FY2024 Actual, FY2024 Preliminary and FY2023 Budgets"]
[]
[null,null,"Education Expenditures",null,null,null,"Offsetting Revenues",null,null,null,"Initial Education Spending"]
[null,null,"2024 Actual","2024 Prelim","2023 Expenditures",null,"2024 Actual","2024 Prelim","2023 Revenues",null,"2024 Actual","2024 Prelim","2023 Ed Spending"]
["LEAID",{"$f":"Cover!$F$6","v":"X"},{"$f":"'Signature Page'!L11","v":0},{"$f":"SUMIF(PreDATAFY24!$A$2:$A$151,$B$6,PreDATAFY24!$B$2:$B$151)","v":0},{"$f":"SUMIF(FY23BUD!$A$2:$A$130,$B6,FY23BUD!$B$2:$B$130)","v":0},null,{"$f":"'Signature Page'!L21","v":0},{"$f":"SUMIF(PreDATAFY24!$A$2:$A$151,$B$6,PreDATAFY24!$C$2:$C$151)","v":0},{"$f":"SUMIF(FY23BUD!$A$2:$A$130,$B6,FY23BUD!$C$2:$C$130)","v":0},null,{"$f":"C6-G6","v":0},{"$f":"SUMIF(PreDATAFY24!$A$2:$A$151,$B$6,PreDATAFY24!$G$2:$G$151)","v":0},{"$f":"IF(E6=\"NA\",\"NA\",E6-I6)","v":0}]
[null,"Percent Change",null,{"$f":"IF(D6>0,((C6-D6)/D6),0)","v":0},{"$f":"IF(E6>0,((D6-E6)/E6),0)","v":0},null,null,{"$f":"IF(H6>0,((G6-H6)/H6),0)","v":0},{"$f":"IF(I6>0,((H6-I6)/I6),0)","v":0},null,null,{"$f":"IF(L6>0,((K6-L6)/L6),0)","v":0},{"$f":"IF(M6>0,((L6-M6)/M6),0)","v":0}]
[]
[]
[null,"LEA",{"$f":"VLOOKUP($B$6,PreDATAFY24!$A$2:$H$151,8,FALSE)","v":{"$error":"#N/A"}}]
{"$rows_left_out":19}
{"sheet":"NEW CODES","index":7,"n_rows":130,"n_cols":12,"rows_kept":130,"cut":false,"hidden":false,"merged":[]}
["LEAID","** SELECT DISTRICT **","LEAID","LEAName",null,"SU id",null,null,null,null,null,"Color Codes"]
["U061","S001    MT. ABRAHAM USD","U061","MT. ABRAHAM USD",null,1,null,null,null,null,null,"Town school district"]
["U054","S002    ADDISON NORTHWEST UUSD","U054","ADDISON NORTHWEST UUSD",null,2,null,null,null,null,null,"Union elementary school district"]
["U055","S003    ADDISON CENTRAL UUSD","U055","ADDISON CENTRAL UUSD",null,3,null,null,null,null,null,"Modified union school district"]
["U062","S004    SLATE VALLEY UUSD ","U062","SLATE VALLEY UUSD",null,4,null,null,null,null,null,"Union high school district"]
["T005","S005    ARLINGTON","T005","ARLINGTON",null,5,null,null,null,null,null,"Unified union school district"]
["T141","S005    NORTH BENNINGTON ID","T141","NORTH BENNINGTON ID",null,5]
["T181","S005    SANDGATE","T181","SANDGATE",null,5]
["T259","S005    Glastenbury","T259","Glastenbury",null,5,null,null,null,null,null,"Districts that may or may not submit budgets"]
["U014","S005    MT. ANTHONY UHSD","U014","MT. ANTHONY UHSD",null,5,null,null,null,null,null,"are in lower-case font and yellow cells."]
{"$rows_left_out":121}
{"sheet":"PreDATAFY24","index":8,"n_rows":129,"n_cols":22,"rows_kept":129,"cut":false,"hidden":false,"merged":[]}
["Source.Name","TotExp","OffRev","Elig CD","EligCD revs","Other Excess Exc","EDSPENDING",null,null,null,null,null,"Updated: ","2023-05-01","FY23 prel",null," Col I"," Col J"," Col K"," Col L"," Col M"," Col O"]
["T003",7280057,622900,0,0,0,6657157,{"$f":"VLOOKUP($A2,FY23prefillData!$A$3:$B$320,2,FALSE)","v":"Alburgh"},null,null,null,null,null,{"$f":"SUM(B2:B131)","v":2039227385},null,null,"TotExp","OffRev","Elig CD","EligCD revs","Other Excess Exc","EDSPENDING"]
["T005",8142943,915982,0,0,0,7226961,{"$f":"VLOOKUP($A3,FY23prefillData!$A$3:$B$320,2,FALSE)","v":"Arlington"},null,null,null,null,null,null,null,"Cut & Paste",2039227385,369422835,22876742,215692,3136863,1669804550]
["T030",2732008,365378,0,0,11000,2366630,{"$f":"VLOOKUP($A4,FY23prefillData!$A$3:$B$320,2,FALSE)","v":"Brighton"},null,null,null,null,null,null,null,"Sums",{"$f":"SUM(B2:B129)","v":2039227385},369422835,22876742,215692,3136863,1669804550]
["T037",104144584,25180146,0,0,0,78964438,{"$f":"VLOOKUP($A5,FY23prefillData!$A$3:$B$320,2,FALSE)","v":"Burlington"},null,null,null,null,null,null,null,"Check",{"$f":"Q3-Q4","v":0},{"$f":"R3-R4","v":0},0,0,0,0]
["T038",3620061,209645,12083,0,1950,3410416,{"$f":"VLOOKUP($A6,FY23prefillData!$A$3:$B$320,2,FALSE)","v":"Cabot"}]
["T040",6709501,837665,355000,0,0,5871836,{"$f":"VLOOKUP($A7,FY23prefillData!$A$3:$B$320,2,FALSE)","v":"Cambridge"}]
["T041",0,0,0,0,0,0,{"$f":"VLOOKUP($A8,FY23prefillData!$A$3:$B$320,2,FALSE)","v":"Canaan"}]
["T044",2664868,397026,4971,0,16599,2267842,{"$f":"VLOOKUP($A9,FY23prefillData!$A$3:$B$320,2,FALSE)","v":"Charleston"}]
["T050",52401407,11451259,0,0,0,40950148,{"$f":"VLOOKUP($A10,FY23prefillData!$A$3:$B$320,2,FALSE)","v":"Colchester"}]
{"$rows_left_out":120}
{"sheet":"BUDDATAFY24","index":9,"n_rows":85,"n_cols":6,"rows_kept":85,"cut":false,"hidden":false,"merged":[]}
["DISTID","TYP","FUND","FUNC","AMOUNT","FY"]
[{"$f":"Expenditures!A2","v":"X"},{"$f":"Expenditures!B2","v":"E"},{"$f":"Expenditures!C2","v":"1"},{"$f":"Expenditures!E2","v":"1000"},{"$f":"Expenditures!G2","v":0},{"$f":"Expenditures!H2","v":"FY24"}]
[{"$f":"Expenditures!A3","v":"X"},{"$f":"Expenditures!B3","v":"E"},{"$f":"Expenditures!C3","v":"1"},{"$f":"Expenditures!E3","v":"1568"},{"$f":"Expenditures!G3","v":0},{"$f":"Expenditures!H3","v":"FY24"}]
[{"$f":"Expenditures!A4","v":"X"},{"$f":"Expenditures!B4","v":"E"},{"$f":"Expenditures!C4","v":"1"},{"$f":"Expenditures!E4","v":"1569"},{"$f":"Expenditures!G4","v":0},{"$f":"Expenditures!H4","v":"FY24"}]
[{"$f":"Expenditures!A5","v":"X"},{"$f":"Expenditures!B5","v":"E"},{"$f":"Expenditures!C5","v":"1"},{"$f":"Expenditures!E5","v":"2396"},{"$f":"Expenditures!G5","v":0},{"$f":"Expenditures!H5","v":"FY24"}]
[{"$f":"Expenditures!A6","v":"X"},{"$f":"Expenditures!B6","v":"E"},{"$f":"Expenditures!C6","v":"1"},{"$f":"Expenditures!E6","v":"2397"},{"$f":"Expenditures!G6","v":0},{"$f":"Expenditures!H6","v":"FY24"}]
[{"$f":"Expenditures!A7","v":"X"},{"$f":"Expenditures!B7","v":"E"},{"$f":"Expenditures!C7","v":"1"},{"$f":"Expenditures!E7","v":"2999"},{"$f":"Expenditures!G7","v":0},{"$f":"Expenditures!H7","v":"FY24"}]
[{"$f":"Expenditures!A8","v":"X"},{"$f":"Expenditures!B8","v":"E"},{"$f":"Expenditures!C8","v":"1"},{"$f":"Expenditures!E8","v":"3100"},{"$f":"Expenditures!G8","v":0},{"$f":"Expenditures!H8","v":"FY24"}]
[{"$f":"Expenditures!A9","v":"X"},{"$f":"Expenditures!B9","v":"E"},{"$f":"Expenditures!C9","v":"1"},{"$f":"Expenditures!E9","v":"3200"},{"$f":"Expenditures!G9","v":0},{"$f":"Expenditures!H9","v":"FY24"}]
[{"$f":"Expenditures!A10","v":"X"},{"$f":"Expenditures!B10","v":"E"},{"$f":"Expenditures!C10","v":"1"},{"$f":"Expenditures!E10","v":"3300"},{"$f":"Expenditures!G10","v":0},{"$f":"Expenditures!H10","v":"FY24"}]
{"$rows_left_out":76}
{"sheet":"LISTvoc","index":10,"n_rows":32,"n_cols":13,"rows_kept":32,"cut":false,"hidden":false,"merged":[]}
[]
["T037",2398,3113,"Burlington"]
["U051",2398,3113,"Essex-Westford EC USD"]
["U088",2398,3113,"Enosburgh-Richford UUSD"]
["U058B",2398,3113,"Lamoille North MUSD"]
["T093",2398,3113,"Hartford",null,null,null,"E","1","LOCAL EDUCATION","1000","DIRECT INSTR-EXCEPT TECH CTR TUITION","FY18"]
["U022B",2398,3113,"North Country Sr UHSD",null,null,null,"E","1","LOCAL EDUCATION","1568","OBJ 568-TCH CTR TUIT/AMT STATE PAYS FOR DST","FY18"]
["U057",2398,3113,"Maple Run USD",null,null,null,"E","1","LOCAL EDUCATION","1569","OBJ 569-DISTRICT TUITION TO TECH CNTRS","FY18"]
["U059",2398,3113,"Orange Southwest USD",null,null,null,"E","1","LOCAL EDUCATION","2396","ADMINISTRATIVE SUPPORT SERVICES - LEA","FY18"]
["U091",2398,3113,"Oxbow UHSD",null,null,null,"E","1","LOCAL EDUCATION","2397","ADMINISTRATIVE SUPPORT SERV. - ASSESS TO SU","FY18"]
{"$rows_left_out":23}
{"sheet":"FY23Exp","index":11,"n_rows":1041,"n_cols":13,"rows_kept":1041,"cut":false,"hidden":false,"merged":[]}
["DSTNAME","SUID","DSTID","MFUNC","MFUNCDESC","FUND","FUNC","DESCRIPTION","AMOUNT","TYP",null,"Updated: ","2023-05-01"]
["Mt. Mansfield UUSD","SU012","U401","1000","DIRECT INSTRUCTION",1,"1000","DIRECT INSTR-EXCEPT TECH CTR TUITION",33543731,"E",null,"Denotes Fund 6"]
["Mt. Mansfield UUSD","SU012","U401","1000","DIRECT INSTRUCTION",1,"1568","OBJ 568-TCH CTR TUIT/AMT STATE PAYS FOR DST",637199,"E","Data come from:",null,"J:\\FY2023\\Base23\\Budget23"]
["Mt. Mansfield UUSD","SU012","U401","1000","DIRECT INSTRUCTION",1,"1569","OBJ 569-DISTRICT TUITION TO TECH CNTRS",521833,"E","prior year budgets",null,"Budget Data Convert FY23 v01.xlsm"]
["Mt. Mansfield UUSD","SU012","U401","2000","SUPPORTING SERVICES",1,"2396","ADMINISTRATIVE SUPPORT SERVICES - LEA",9452578,"E"]
["Mt. Mansfield UUSD","SU012","U401","2000","SUPPORTING SERVICES",1,"2999","ALL FUNC 2000 SUPPORT SERV. NOT INCL. ABOVE",6883845,"E"]
["Mt. Mansfield UUSD","SU012","U401","4000","FACILITY ACQUISITION AND CONSTRUCTION",1,"4000","FACILITY ACQUISITION AND CONSTRUCTION",325000,"E"]
["Mt. Mansfield UUSD","SU012","U401","5000","OTHER EXPENDITURES",1,"5100","OTHER-DEBT SERVICE",724709,"E"]
["Mt. Mansfield UUSD","SU012","U401","5000","OTHER EXPENDITURES",1,"5310","TRANSFERS TO ENTERPRISE FUNDS",82000,"E"]
["Mt. Mansfield UUSD","SU012","U401","5000","OTHER EXPENDITURES",1,"5350","CONTRS TO RSRVD ACCTS (INC. FUNC 5352)",100000,"E"]
{"$rows_left_out":1032}
{"sheet":"FY23Rev","index":12,"n_rows":5759,"n_cols":13,"rows_kept":5759,"cut":false,"hidden":false,"merged":[]}
["SUID","DSTID","DSTNAME","MFUNC","MFUNCDESC","FUND","FUNC","DESCRIPTION","AMOUNT","TYP",null,"Updated: ","2023-05-01"]
["SU012","U401","Mt. Mansfield UUSD","1300","TUITION RECEIVED",5,"1300","TUITION RECEIVED",80000,"R",null,"Denotes Fund 6"]
["SU012","U401","Mt. Mansfield UUSD","1400","TRANSPORTATION FEES RECEIVED",5,"1400","TRANSPORTATION FEES RECEIVED",4000,"R","Data come from:",null,"J:\\FY2023\\Base23\\Budget23"]
["SU012","U401","Mt. Mansfield UUSD","1500","EARNINGS ON INVESTMENTS",5,"1500","EARNINGS ON INVESTMENTS",110000,"R","prior year budgets",null,"Budget Data Convert FY23 v01.xlsm"]
["SU012","U401","Mt. Mansfield UUSD","1900","OTHER REVENUE FROM LOCAL SOURCES",5,"1920","CONTRIBUTIONS AND DONATIONS RAISED BY THE LEA",10000,"R"]
["SU012","U401","Mt. Mansfield UUSD","1900","OTHER REVENUE FROM LOCAL SOURCES",5,"1999","ALL OTHER 1900 REVENUES (EXCEPT ACT 144 REVENUES)",58500,"R"]
["SU012","U401","Mt. Mansfield UUSD","3100","UNRESTRICTED GRANTS IN AID",5,"3110","EDUCATION SPENDING GRANT",42903553,"R"]
["SU012","U401","Mt. Mansfield UUSD","3100","UNRESTRICTED GRANTS IN AID",5,"3114","SUP TUITION GRANT FOR TECH CTRS DISTRIB BY STATE",637199,"R"]
["SU012","U401","Mt. Mansfield UUSD","3100","UNRESTRICTED GRANTS IN AID",5,"3145","SMALL SCHOOLS GRANT",42632,"R"]
["SU012","U401","Mt. Mansfield UUSD","3100","UNRESTRICTED GRANTS IN AID",5,"3150","STATE AID TRANSPORTATION",905000,"R"]
{"$rows_left_out":5750}
{"sheet":"FY23BUD","index":13,"n_rows":130,"n_cols":19,"rows_kept":130,"cut":false,"hidden":false,"merged":[]}
["DISTID","ACT_EXP","ACT_REV","ACT_EdSpnd","GOVID","FY","SUID",null,null,null,null,null,null,"Updated:","2023-05-01",null,"Tot Exp","Off Rev","Ed Spend"]
["U061",32665311,4047597,28617714,{"$f":"A2","v":"U061"},"FY23",1,null,"Data are sorted by SUid then DISTID - bcj",null,null,null,"U061","Mt. Abraham USD",null,"FY23Fin v05",1954323361,377625188,1576698173]
["U054",22327585,3795216,18532369,"U054","FY23",2,null,null,null,null,null,"U054","Addison NW USD",null,null,{"$f":"SUM(B$2:B$241)","v":1954323361},{"$f":"SUM(C$2:C$241)","v":377625188},{"$f":"SUM(D$2:D$241)","v":1576698173}]
["U055",43901188,9337870,34563318,"U055","FY23",3,null,"Update column A with prior year districts",null,null,null,"U055","Addison Central USD",null,"Check",{"$f":"Q2-Q3","v":0},{"$f":"R2-R3","v":0},0]
["U062",26236547,4638426,21598121,"U062","FY23",4,null,null,"ACT_EXP",null,null,"U062","Slate Valley USD"]
["T141",3224363,152700,3071663,"T141","FY23",5,null,null,"ACT_REV",null,null,"T141","North Bennington ID"]
["T259",0,0,0,{"$f":"A7","v":"T259"},"FY23",5,null,null,"ACT_REV",null,null,"T259","Glastenbury"]
["U014",28615127,3156944,25458183,"U014","FY23",5,null,null,"ACT_EdSpnd",null,null,"U014","Mt. Anthony UHSD"]
["U087",26425265,2352095,24073170,"U087","FY23",5,null,null,null,null,null,"U087","Southwest Vermont UESD"]
["T248",4981546,142104,4839442,"T248","FY23",6,null,null,null,null,null,"T248","Winhall"]
{"$rows_left_out":121}
{"sheet":"FY23prefillData","index":14,"n_rows":320,"n_cols":17,"rows_kept":320,"cut":false,"hidden":false,"merged":[]}
["GovID","LEAID","FY24 FTEs","On-behalf","SpEd2yrprior","SU",null,null,null,null,null,null,"For FY2024:"]
[null,"Totals ",{"$f":"SUM(C3:C320)","v":2227.0199999999995},{"$f":"SUM(D3:D320)","v":24221068},{"$f":"SUM(E3:E320)","v":590441},"na",null,null,"Updated:",null,2142332,null,"T112","Lincoln out of U061 Mt. Abraham USD and S001",null,null,"5% local share of SpEd ExtOrd is at SU level."]
["T031","Bristol",0,{"$f":"ROUND(C3*$I$12,0)","v":0},0,1,null,null,"2023-05-01",null,{"$f":"SUM(E3:E329)","v":590441},null,"T198","Stowe out of U090 Lamoille South UUSD",null,null,"Cannnot break it out to districts within SUs."]
["T127","Monkton",0,0,0,1,null,null,null,null,{"$f":"K2-K3","v":1551891}]
["T138","New Haven",0,0,0,1]
["T196","Starksboro",0,0,0,1,null,null,2227.0199999999995,"FY23 6-sem avg total"]
["U061","Mt. Abraham USD",33.449999999999996,363802,38516,1,null,null,{"$f":"SUM(C3:C320)","v":2227.0199999999995}]
["T001","Addison",0,0,0,2,null,null,{"$f":"I6-I7","v":0},"Check"]
["T076","Ferrisburgh",0,0,0,2]
["T149","Panton",0,0,0,2,null,null,12501,"FY23 based ed amt"]
{"$rows_left_out":310}